Target
Thymidine kinase
Ligand
BDBM50472253
Substrate
Meas. Tech.
ChEMBL_61074 (CHEMBL674914)
EC50
17200±n/a nM
Citation
 Holý, AGünter, JDvoráková, HMasojídková, MAndrei, GSnoeck, RBalzarini, JDe Clercq, E Structure-antiviral activity relationship in the series of pyrimidine and purine N-[2-(2-phosphonomethoxy)ethyl] nucleotide analogues. 1. Derivatives substituted at the carbon atoms of the base. J Med Chem 42:2064-86 (1999)  
Target
Name:
Thymidine kinase
Synonyms:
KITH_HHV1S Thymidine kinase | UL23
Type:
PROTEIN
Mol. Mass.:
40883.42
Organism:
Human herpesvirus 1 (strain SC16) (HHV-1) (Human herpes simplex virus1)
Description:
ChEMBL_213
Residue:
376
  
Inhibitor
Name:
BDBM50472253
Synonyms:
CHEMBL62367
Type:
Small organic molecule
Emp. Form.:
C11H18N5O5P
Mol. Mass.:
331.2649
SMILES:
CC(C)OP(O)(=O)COCCn1cnc2c(O)nc(N)nc12
: