Target
Beta-1 adrenergic receptor
Ligand
BDBM25392
Substrate
Meas. Tech.
ChEMBL_37521 (CHEMBL647364)
Ki
1585±n/a nM
Citation
 Zheng, WNikulin, VIKonkar, AAVansal, SSShams, GFeller, DRMiller, DD 2-Amino-4-benzyl-4,5,6,7-tetrahydrothiazolo[5,4-c]pyridines: novel selective beta3-adrenoceptor agonists. J Med Chem 42:2287-94 (1999)  
Target
Name:
Beta-1 adrenergic receptor
Synonyms:
ADRB1 ADRB1_HUMAN Beta-1 adrenoceptor adrenergic Beta1
Type:
G Protein-Coupled Receptor (GPCR)
Mol. Mass.:
51338.40
Organism:
Homo sapiens (Human)
Description:
P08588
Residue:
477
  
Inhibitor
Name:
BDBM25392
Synonyms:
4-[1-hydroxy-2-(isopropylamino)ethyl]pyrocatechol;hydrochloride 4-{1-hydroxy-2-[(propan-2-yl)amino]ethyl}benzene-1,2-diol, 2 ISOPROTERONOL Isoproterenol Isoproterenol,(+) Norisodrine | Novodrin
Type:
Small organic molecule
Emp. Form.:
C11H17NO3
Mol. Mass.:
211.2576
SMILES:
CC(C)NCC(O)c1ccc(O)c(O)c1
: