Target
Amine oxidase [flavin-containing] A/B
Ligand
BDBM50138500
Substrate
Meas. Tech.
ChEMBL_220597 (CHEMBL842750)
Ki
1.9±n/a nM
Citation
 Quaglia, WBousquet, PPigini, MCarotti, ACarrieri, ADontenwill, MGentili, FGiannella, MMaranca, FPiergentili, ABrasili, L 2-(2-Phenylcyclopropyl)imidazolines: reversed enantioselective interaction at I(1) and I(2) imidazoline receptors. J Med Chem 42:2737-40 (1999)  
Target
Name:
Amine oxidase [flavin-containing] A/B
Synonyms:
Imidazoline I2-receptor | Monoamine oxidase
Type:
Mol. Mass.:
Description:
ASSAY_ID of EBI is 220586
Components:
This complex has 2 components.
Component 1
Name:
Amine oxidase [flavin-containing] A
Synonyms:
AOFA_HUMAN MAO-A Monoamine oxidase Monoamine oxidase type A (MAO A) Monoamine oxidase type A (MAOA)
Type:
Protein
Mol. Mass.:
59689.53
Organism:
Homo sapiens (Human)
Description:
P21397
Residue:
527
  
Component 2
Name:
Amine oxidase [flavin-containing] B
Synonyms:
AOFB_HUMAN MAOB Monoamine oxidase type B (MAO B) Monoamine oxidase type B (MAOB)
Type:
Protein
Mol. Mass.:
58768.76
Organism:
Homo sapiens (Human)
Description:
P27338
Residue:
520
  
Inhibitor
Name:
BDBM50138500
Synonyms:
2-((E)-Styryl)-4,5-dihydro-1H-imidazole CHEMBL275970
Type:
Small organic molecule
Emp. Form.:
C11H12N2
Mol. Mass.:
172.2264
SMILES:
C1CN=C(N1)\C=C\c1ccccc1
: