Target
Alpha-1A adrenergic receptor
Ligand
BDBM50416853
Substrate
Meas. Tech.
ChEMBL_33889 (CHEMBL645467)
Ki
9.33±n/a nM
Citation
 Quaglia, WPigini, MPiergentili, AGiannella, MMarucci, GPoggesi, ELeonardi, AMelchiorre, C Structure-activity relationships in 1,4-benzodioxan-related compounds. 6. Role of the dioxane unit on selectivity for alpha(1)-adrenoreceptor subtypes. J Med Chem 42:2961-8 (1999)  
Target
Name:
Alpha-1A adrenergic receptor
Synonyms:
ADA1A_HUMAN ADRA1C Alpha 1A-adrenoceptor Alpha adrenergic receptor 1a Alpha-adrenergic receptor 1c adrenergic Alpha1 | adrenergic Alpha1C
Type:
Cell-surface receptors
Mol. Mass.:
51511.67
Organism:
Homo sapiens (Human)
Description:
P35348
Residue:
466
  
Inhibitor
Name:
BDBM50416853
Synonyms:
CHEMBL43116
Type:
Small organic molecule
Emp. Form.:
C25H29NO5
Mol. Mass.:
423.5015
SMILES:
COc1cccc(OC)c1OCCNCCOc1ccccc1OCc1ccccc1
: