Target
Alpha-1D adrenergic receptor
Ligand
BDBM50416853
Substrate
Meas. Tech.
ChEMBL_32604 (CHEMBL642131)
Ki
10.2±n/a nM
Citation
 Quaglia, WPigini, MPiergentili, AGiannella, MMarucci, GPoggesi, ELeonardi, AMelchiorre, C Structure-activity relationships in 1,4-benzodioxan-related compounds. 6. Role of the dioxane unit on selectivity for alpha(1)-adrenoreceptor subtypes. J Med Chem 42:2961-8 (1999)  
Target
Name:
Alpha-1D adrenergic receptor
Synonyms:
ADA1D_HUMAN ADRA1D Adrenergic receptor alpha Alpha 1D-adrenoreceptor Alpha-1D adrenoceptor adrenergic Alpha1D
Type:
Enzyme Catalytic Domain
Mol. Mass.:
60485.82
Organism:
Homo sapiens (Human)
Description:
adrenergic Alpha1D ADRA1D HUMAN::P25100
Residue:
572
  
Inhibitor
Name:
BDBM50416853
Synonyms:
CHEMBL43116
Type:
Small organic molecule
Emp. Form.:
C25H29NO5
Mol. Mass.:
423.5015
SMILES:
COc1cccc(OC)c1OCCNCCOc1ccccc1OCc1ccccc1
: