Target
Alpha-1B adrenergic receptor
Ligand
BDBM50416853
Substrate
Meas. Tech.
ChEMBL_34621 (CHEMBL643902)
Ki
9.27±n/a nM
Citation
 Quaglia, WPigini, MPiergentili, AGiannella, MMarucci, GPoggesi, ELeonardi, AMelchiorre, C Structure-activity relationships in 1,4-benzodioxan-related compounds. 6. Role of the dioxane unit on selectivity for alpha(1)-adrenoreceptor subtypes. J Med Chem 42:2961-8 (1999)  
Target
Name:
Alpha-1B adrenergic receptor
Synonyms:
ADA1B_HUMAN Adrenergic alpha1B Adrenergic receptor alpha Alpha 1B-adrenoreceptor | Alpha-1B adrenergic receptor
Type:
Enzyme
Mol. Mass.:
56862.13
Organism:
Homo sapiens (Human)
Description:
P35368
Residue:
520
  
Inhibitor
Name:
BDBM50416853
Synonyms:
CHEMBL43116
Type:
Small organic molecule
Emp. Form.:
C25H29NO5
Mol. Mass.:
423.5015
SMILES:
COc1cccc(OC)c1OCCNCCOc1ccccc1OCc1ccccc1
: