Target
Melatonin receptor type 1C
Ligand
BDBM50470187
Substrate
Meas. Tech.
ChEMBL_104615 (CHEMBL715563)
Ki
0.100000±n/a nM
Citation
 Jellimann, CMathé-Allainmat, MAndrieux, JRenard, PDelagrange, PLanglois, M Melatonergic properties of the (+)- and (-)-enantiomers of N-(4-methoxy-2,3-dihydro-1H-phenalen-2-yl)amide derivatives. J Med Chem 42:1100-5 (1999)  
Target
Name:
Melatonin receptor type 1C
Synonyms:
CKB Mel-1C-R Melatonin receptor type 1C
Type:
PROTEIN
Mol. Mass.:
38595.98
Organism:
Gallus gallus
Description:
ChEMBL_104739
Residue:
346
  
Inhibitor
Name:
BDBM50470187
Synonyms:
CHEMBL428882
Type:
Small organic molecule
Emp. Form.:
C16H19NO3
Mol. Mass.:
273.327
SMILES:
COc1ccc2ccc(OC)c(CCNC(C)=O)c2c1
: