Target
Sodium channel protein type 1/2/3 subunit alpha
Ligand
BDBM50022495
Substrate
Meas. Tech.
ChEMBL_215124 (CHEMBL820390)
IC50
251000±n/a nM
Citation
 Brown, MLZha, CCVan Dyke, CCBrown, GBBrouillette, WJ Comparative molecular field analysis of hydantoin binding to the neuronal voltage-dependent sodium channel. J Med Chem 42:1537-45 (1999)  
Target
Name:
Sodium channel protein type 1/2/3 subunit alpha
Synonyms:
Sodium channel alpha subunits; brain (Types I, II, III) | Sodium channel protein type I I alpha subunit
Type:
Mol. Mass.:
Description:
ASSAY_ID of EBI is 202416
Components:
This complex has 3 components.
Component 1
Name:
Sodium channel protein type 1 subunit alpha
Synonyms:
SCN1A_RAT Sodium (Site 1) Sodium channel protein type I alpha subunit Sodium channel protein, brain I subunit alpha Voltage-gated sodium channel subunit alpha Nav1.1
Type:
PROTEIN
Mol. Mass.:
228753.20
Organism:
Rattus norvegicus
Description:
ChEMBL_938840
Residue:
2009
  
Component 2
Name:
Sodium channel protein type 2 subunit alpha
Synonyms:
SCN2A_RAT Scn2a1 Sodium channel protein type 2 subunit alpha Sodium channel protein type II subunit alpha Voltage-gated sodium channel | Voltage-gated sodium channel subunit alpha Nav1.2
Type:
PROTEIN
Mol. Mass.:
227854.11
Organism:
Rattus norvegicus
Description:
ChEMBL_1516893
Residue:
2005
  
Component 3
Name:
Sodium channel protein type 3 subunit alpha
Synonyms:
SCN3A_RAT Sodium channel protein type 3 subunit alpha Sodium channel protein type III subunit alpha Voltage-gated sodium channel Voltage-gated sodium channel subunit alpha Nav1.3
Type:
PROTEIN
Mol. Mass.:
221371.72
Organism:
Rattus norvegicus
Description:
ChEMBL_1516894
Residue:
1951
  
Inhibitor
Name:
BDBM50022495
Synonyms:
6,7,8,9-tetrahydro-2'H,5'H-spiro[benzo[7]annulene-5,4'-imidazolidine]-2',5'-dione CHEMBL39377 | spiro[6,7,8,9-tetrahydro-5H-benzo[a]cycloheptene-5,4'-(tetrahydro-1'H-imidazole)]-2',5'-dione
Type:
Small organic molecule
Emp. Form.:
C13H14N2O2
Mol. Mass.:
230.2625
SMILES:
O=C1NC(=O)C2(CCCCc3ccccc23)N1
: