Target
Gastrin/cholecystokinin type B receptor
Ligand
BDBM50472889
Substrate
Meas. Tech.
ChEMBL_48108 (CHEMBL663095)
Ki
0.177828±n/a nM
Citation
 Ursini, ACapelli, AMCarr, RACassarà, PCorsi, MCurcuruto, OCurotto, GDal Cin, MDavalli, SDonati, DFeriani, AFinch, HFinizia, GGaviraghi, GMarien, MPentassuglia, GPolinelli, SRatti, EReggiani, AMTarzia, GTedesco, GTranquillini, METrist, DGVan Amsterdam, FTReggiani, A Synthesis and SAR of new 5-phenyl-3-ureido-1,5-benzodiazepines as cholecystokinin-B receptor antagonists. J Med Chem 43:3596-613 (2000)  
Target
Name:
Gastrin/cholecystokinin type B receptor
Synonyms:
CCK-2 receptor CCK-BR CCKRB Cholecystokinin receptor GASR_HUMAN | Gastrin/cholecystokinin type B receptor
Type:
G Protein-Coupled Receptor (GPCR)
Mol. Mass.:
48445.79
Organism:
Homo sapiens (Human)
Description:
Stable expression of human CCK-2 receptors in HEK 293 cells.
Residue:
447
  
Inhibitor
Name:
BDBM50472889
Synonyms:
CHEMBL415240
Type:
Small organic molecule
Emp. Form.:
C34H36N4O4
Mol. Mass.:
564.674
SMILES:
[H][C@]12C[C@]3([H])C[C@]([H])(C1)CC(CN1c4ccccc4N(c4ccccc4)C(=O)C(NC(=O)Nc4cccc(CO)c4)C1=O)(C2)C3
: