Target
Gag-Pol polyprotein
Ligand
BDBM50027120
Substrate
Meas. Tech.
ChEBML_196792
IC50
6500±n/a nM
Citation
 Wu, RSWolpert-DeFilippes, MKQuinn, FR Quantitative structure--activity correlations of rifamycins as inhibitors of viral RNA-directed DNA polymerase and mammalian alpha and beta DNA polymerases. J Med Chem 23:256-61 (1980)  
Target
Name:
Gag-Pol polyprotein
Synonyms:
POL_WMSV pol
Type:
PROTEIN
Mol. Mass.:
32733.90
Organism:
Woolly monkey sarcoma virus
Description:
ChEMBL_196792
Residue:
294
  
Inhibitor
Name:
BDBM50027120
Synonyms:
2,15,17,29-tetrahydroxy-11-methoxy-3,7,12,14,16,18,22-heptamethyl-26-(Azacyclohexadec-1-yl)-methylene-amino-6,23-dioxo-8,30-dioxa-24-azatetracyclo[23.3.1.14,7.05,28]triaconta-1(28),2,4,9,19,21,25(29),26-octaen-13-yl acetate CHEMBL407537
Type:
Small organic molecule
Emp. Form.:
C53H77N3O11
Mol. Mass.:
932.192
SMILES:
COC1\C=C\OC2(C)Oc3c(C2=O)c2cc(\C=N\N4CCCCCCCCCCCCCCC4)c(NC(=O)\C(C)=C/C=C/C(C)C(O)C(C)C(O)C(C)C(OC(C)=O)C1C)c(O)c2c(O)c3C
: