Target
DNA polymerase beta
Ligand
BDBM50027130
Substrate
Meas. Tech.
ChEBML_50773
IC50
13000±n/a nM
Citation
 Wu, RSWolpert-DeFilippes, MKQuinn, FR Quantitative structure--activity correlations of rifamycins as inhibitors of viral RNA-directed DNA polymerase and mammalian alpha and beta DNA polymerases. J Med Chem 23:256-61 (1980)  
Target
Name:
DNA polymerase beta
Synonyms:
DPOLB_MOUSE | Polb
Type:
PROTEIN
Mol. Mass.:
38297.87
Organism:
Mus musculus
Description:
ChEMBL_50773
Residue:
335
  
Inhibitor
Name:
BDBM50027130
Synonyms:
2,15,17,29-tetrahydroxy-11-methoxy-3,7,12,14,16,18,22-heptamethyl-26-carbaldehyde O-octyl-oxime-6,23-dioxo-8,30-dioxa-24-azatetracyclo[23.3.1.14,7.05,28]triaconta-1(28),2,4,9,19,21,25(29),26-octaen-13-yl acetate | CHEMBL82619
Type:
Small organic molecule
Emp. Form.:
C46H64N2O12
Mol. Mass.:
837.0066
SMILES:
CCCCCCCCO\N=C\c1cc2c3C(=O)C4(C)Oc3c(C)c(O)c2c(O)c1NC(=O)\C(C)=C/C=C/C(C)C(O)C(C)C(O)C(C)C(OC(C)=O)C(C)C(OC)\C=C\O4
: