Target
Gag-Pol polyprotein
Ligand
BDBM50222129
Substrate
Meas. Tech.
ChEMBL_196794 (CHEMBL799737)
Ki
30902954±n/a nM
Citation
 Wu, RSWolpert-DeFilippes, MKQuinn, FR Quantitative structure--activity correlations of rifamycins as inhibitors of viral RNA-directed DNA polymerase and mammalian alpha and beta DNA polymerases. J Med Chem 23:256-61 (1980)  
Target
Name:
Gag-Pol polyprotein
Synonyms:
POL_WMSV pol
Type:
PROTEIN
Mol. Mass.:
32733.90
Organism:
Woolly monkey sarcoma virus
Description:
ChEMBL_196792
Residue:
294
  
Inhibitor
Name:
BDBM50222129
Synonyms:
CHEMBL313144
Type:
Small organic molecule
Emp. Form.:
C44H59N3O11
Mol. Mass.:
805.9528
SMILES:
COC1\C=C\OC2(C)Oc3c(C2=O)c2cc(\C=N\N4CCCCCC4)c(NC(=O)\C(C)=C/C=C/C(C)C(O)C(C)C(O)C(C)C(OC(C)=O)C1C)c(O)c2c(O)c3C
: