Target
Acetylcholine receptor subunit alpha/beta/delta/gamma
Ligand
BDBM50473034
Substrate
Meas. Tech.
ChEMBL_223227 (CHEMBL843811)
IC50
35000±n/a nM
Citation
 Strømgaard, KBrier, TJAndersen, KMellor, IRSaghyan, ATikhonov, DUsherwood, PNKrogsgaard-Larsen, PJaroszewski, JW Solid-phase synthesis and biological evaluation of a combinatorial library of philanthotoxin analogues. J Med Chem 43:4526-33 (2000)  
Target
Name:
Acetylcholine receptor subunit alpha/beta/delta/gamma
Synonyms:
Acetylcholine receptor protein alpha chain/beta chain/delta chain /gamma chain | Acetylcholine receptor; alpha1/beta1/delta/gamma
Type:
Mol. Mass.:
Description:
ASSAY_ID of EBI is 369002
Components:
This complex has 4 components.
Component 1
Name:
Acetylcholine receptor subunit alpha
Synonyms:
ACHA_HUMAN Acetylcholine receptor protein alpha chain CHNRA Cholinergic, Nicotinic Alpha1Beta1DeltaGamma Nicotinic acetylcholine receptor alpha-1/beta-1 Nicotinic acetylcholine receptor alpha2/beta4 n-AChR
Type:
Ion channel
Mol. Mass.:
54542.01
Organism:
Homo sapiens (Human)
Description:
Residue:
482
  
Component 2
Name:
Acetylcholine receptor subunit beta
Synonyms:
ACHB_HUMAN Acetylcholine receptor subunit beta CHRNB1 | Nicotinic acetylcholine receptor alpha-1/beta-1/delta/epsilon
Type:
PROTEIN
Mol. Mass.:
56691.23
Organism:
Homo sapiens (Human)
Description:
EBI_10924
Residue:
501
  
Component 3
Name:
Acetylcholine receptor subunit gamma
Synonyms:
ACHG_HUMAN Acetylcholine receptor subunit gamma Muscle-type nicotinic acetylcholine receptor
Type:
PROTEIN
Mol. Mass.:
57880.69
Organism:
Homo sapiens (Human)
Description:
EBI_11211
Residue:
517
  
Component 4
Name:
Acetylcholine receptor subunit delta
Synonyms:
ACHD_HUMAN Acetylcholine receptor protein delta chain Muscle-type nicotinic acetylcholine receptor | Nicotinic acetylcholine receptor alpha-1/beta-1/delta/epsilon
Type:
PROTEIN
Mol. Mass.:
58894.39
Organism:
Homo sapiens (Human)
Description:
ChEMBL_142595
Residue:
517
  
Inhibitor
Name:
BDBM50473034
Synonyms:
CHEMBL139085
Type:
Small organic molecule
Emp. Form.:
C27H39N3O5
Mol. Mass.:
485.6157
SMILES:
NCCCOCCCCOCCCNC(=O)[C@H](Cc1ccc(O)cc1)NC(=O)Cc1ccccc1
: