Target
Thymidine kinase, cytosolic
Ligand
BDBM50027352
Substrate
Meas. Tech.
ChEMBL_207844 (CHEMBL810053)
Ki
2000±n/a nM
Citation
 Schroeder, ACBardos, TJCheng, YC Synthesis and antiviral activity of 1-(2-deoxy-beta-D-ribofuranosyl)-5-(methylmercapto)-2-pyrimidinone. J Med Chem 24:109-12 (1981)  
Target
Name:
Thymidine kinase, cytosolic
Synonyms:
KITH_HUMAN | TK1
Type:
PROTEIN
Mol. Mass.:
25476.50
Organism:
Homo sapiens (Human)
Description:
ChEMBL_1333884
Residue:
234
  
Inhibitor
Name:
BDBM50027352
Synonyms:
1-(4,5-Dihydroxy-tetrahydro-furan-2-yl)-5-methylsulfanyl-1H-pyrimidin-2-one | CHEMBL268232
Type:
Small organic molecule
Emp. Form.:
C9H12N2O4S
Mol. Mass.:
244.268
SMILES:
CSc1cnc(=O)n(c1)C1CC(O)C(O)O1
: