Target
Neuronal acetylcholine receptor subunit alpha-4/beta-2
Ligand
BDBM50036166
Substrate
Meas. Tech.
ChEMBL_157 (CHEMBL857972)
Ki
7.59±n/a nM
Citation
 Gohlke, HSchwarz, SGündisch, DTilotta, MCWeber, AWegge, TSeitz, G 3D QSAR analyses-guided rational design of novel ligands for the (alpha4)2(beta2)3 nicotinic acetylcholine receptor. J Med Chem 46:2031-48 (2003)  
Target
Name:
Neuronal acetylcholine receptor subunit alpha-4/beta-2
Synonyms:
Neuronal acetylcholine receptor alpha4/beta2 Neuronal acetylcholine receptor; alpha4/beta2
Type:
Mol. Mass.:
Description:
Components:
This complex has 0 components.
Component 1
Name:
Neuronal acetylcholine receptor subunit alpha-4
Synonyms:
ACHA4_RAT Cholinergic, Nicotinic Alpha4Beta2 Chrna4 Neuronal acetylcholine receptor (alpha4beta2 nAChR) Neuronal acetylcholine receptor subunit alpha 4 beta 2 | Neuronal acetylcholine receptor subunit alpha-4
Type:
Enzyme
Mol. Mass.:
70196.44
Organism:
Rattus norvegicus (Rat)
Description:
P09483
Residue:
630
  
Component 2
Name:
Neuronal acetylcholine receptor subunit beta-2
Synonyms:
ACHB2_RAT Chrnb2 Neuronal acetylcholine receptor non-alpha-1 chain
Type:
Enzyme
Mol. Mass.:
56910.32
Organism:
Rattus norvegicus (Rat)
Description:
P12390
Residue:
500
  
Inhibitor
Name:
BDBM50036166
Synonyms:
3-(pyridin-3-yl)-1-azabicyclo[2.2.2]oct-2-ene CHEMBL64779
Type:
Small organic molecule
Emp. Form.:
C12H14N2
Mol. Mass.:
186.253
SMILES:
C1CN2CCC1C(=C2)c1cccnc1
: