Target
Amine oxidase [flavin-containing] A/B
Ligand
BDBM50138499
Substrate
Meas. Tech.
ChEMBL_220595 (CHEMBL842748)
Ki
2.5±n/a nM
Citation
 Gentili, FBousquet, PBrasili, LDontenwill, MFeldman, JGhelfi, FGiannella, MPiergentili, AQuaglia, WPigini, M Imidazoline binding sites (IBS) profile modulation: key role of the bridge in determining I1-IBS or I2-IBS selectivity within a series of 2-phenoxymethylimidazoline analogues. J Med Chem 46:2169-76 (2003)  
Target
Name:
Amine oxidase [flavin-containing] A/B
Synonyms:
Imidazoline I2-receptor | Monoamine oxidase
Type:
Mol. Mass.:
Description:
ASSAY_ID of EBI is 220586
Components:
This complex has 2 components.
Component 1
Name:
Amine oxidase [flavin-containing] A
Synonyms:
AOFA_HUMAN MAO-A Monoamine oxidase Monoamine oxidase type A (MAO A) Monoamine oxidase type A (MAOA)
Type:
Protein
Mol. Mass.:
59689.53
Organism:
Homo sapiens (Human)
Description:
P21397
Residue:
527
  
Component 2
Name:
Amine oxidase [flavin-containing] B
Synonyms:
AOFB_HUMAN MAOB Monoamine oxidase type B (MAO B) Monoamine oxidase type B (MAOB)
Type:
Protein
Mol. Mass.:
58768.76
Organism:
Homo sapiens (Human)
Description:
P27338
Residue:
520
  
Inhibitor
Name:
BDBM50138499
Synonyms:
2-Phenethyl-4,5-dihydro-1H-imidazole | CHEMBL14210
Type:
Small organic molecule
Emp. Form.:
C11H14N2
Mol. Mass.:
174.2423
SMILES:
C(Cc1ccccc1)C1=NCCN1
: