Target
Similar to alpha-tubulin isoform 1
Ligand
BDBM50147362
Substrate
Meas. Tech.
ChEMBL_212009 (CHEMBL815109)
IC50
300±n/a nM
Citation
 Liou, JPChang, JYChang, CWChang, CYMahindroo, NKuo, FMHsieh, HP Synthesis and structure-activity relationships of 3-aminobenzophenones as antimitotic agents. J Med Chem 47:2897-905 (2004)  
Target
Name:
Similar to alpha-tubulin isoform 1
Synonyms:
Similar to alpha-tubulin isoform 1
Type:
PROTEIN
Mol. Mass.:
10383.05
Organism:
Bos taurus
Description:
ChEMBL_104716
Residue:
99
  
Inhibitor
Name:
BDBM50147362
Synonyms:
CHEMBL330407 | ST-3100
Type:
Small organic molecule
Emp. Form.:
C18H21NO4
Mol. Mass.:
315.3636
SMILES:
COc1ccc(\C=C/c2cc(OC)c(OC)c(OC)c2)cc1N
: