Target
Tyrosine-protein kinase ABL1/ABL2
Ligand
BDBM6094
Substrate
Meas. Tech.
ChEMBL_29688 (CHEMBL636888)
IC50
2.9±n/a nM
Citation
 Boschelli, DHWang, YDJohnson, SWu, BYe, FBarrios Sosa, ACGolas, JMBoschelli, F 7-Alkoxy-4-phenylamino-3-quinolinecar-bonitriles as dual inhibitors of Src and Abl kinases. J Med Chem 47:1599-601 (2004)  
Target
Name:
Tyrosine-protein kinase ABL1/ABL2
Synonyms:
Tyrosine-protein kinase ABL
Type:
Mol. Mass.:
Description:
ASSAY_ID of EBI is 226000
Components:
This complex has 2 components.
Component 1
Name:
Tyrosine-protein kinase ABL1
Synonyms:
ABL ABL1_HUMAN JTK7 Proto-oncogene tyrosine-protein kinase ABL1 Tyrosine-protein kinase ABL V-abl Abelson murine leukemia viral oncogene homolog 1 p150 | tyrosine-protein kinase ABL1 isoform a
Type:
Enzyme
Mol. Mass.:
122897.30
Organism:
Homo sapiens (Human)
Description:
P00519
Residue:
1130
  
Component 2
Name:
Tyrosine-protein kinase ABL2
Synonyms:
ABL2 ABLL Abelson murine leukemia viral oncogene homolog 2 Tyrosine kinase ARG | VHL/Tyrosine-protein kinase ABL2
Type:
PROTEIN
Mol. Mass.:
128360.63
Organism:
Homo sapiens (Human)
Description:
ChEMBL_325082
Residue:
1182
  
Inhibitor
Name:
BDBM6094
Synonyms:
3-quinolinecarbonitrile 18 4-[(2,4-dichloro-5-methoxyphenyl)amino]-6-methoxy-7-[(1-methylpiperidin-4-yl)methoxy]quinoline-3-carbonitrile | 4-phenylamino-3-quinolinecarbonitrile 2
Type:
Small organic molecule
Emp. Form.:
C25H26Cl2N4O3
Mol. Mass.:
501.405
SMILES:
COc1cc(Nc2c(cnc3cc(OCC4CCN(C)CC4)c(OC)cc23)C#N)c(Cl)cc1Cl
: