Target
Proto-oncogene tyrosine-protein kinase Src
Ligand
BDBM6094
Substrate
Meas. Tech.
ChEMBL_202603 (CHEMBL806427)
IC50
7.0±n/a nM
Citation
 Boschelli, DHWang, YDJohnson, SWu, BYe, FBarrios Sosa, ACGolas, JMBoschelli, F 7-Alkoxy-4-phenylamino-3-quinolinecar-bonitriles as dual inhibitors of Src and Abl kinases. J Med Chem 47:1599-601 (2004)  
Target
Name:
Proto-oncogene tyrosine-protein kinase Src
Synonyms:
Calmodulin/Proto-oncogene tyrosine-protein kinase Src Proto-oncogene c-Src SRC SRC_HUMAN V-src sarcoma (Schmidt-Ruppin A-2) viral oncogene homolog (avian) p60-Src | pp60c-src
Type:
Protein
Mol. Mass.:
59838.60
Organism:
Homo sapiens (Human)
Description:
P12931
Residue:
536
  
Inhibitor
Name:
BDBM6094
Synonyms:
3-quinolinecarbonitrile 18 4-[(2,4-dichloro-5-methoxyphenyl)amino]-6-methoxy-7-[(1-methylpiperidin-4-yl)methoxy]quinoline-3-carbonitrile | 4-phenylamino-3-quinolinecarbonitrile 2
Type:
Small organic molecule
Emp. Form.:
C25H26Cl2N4O3
Mol. Mass.:
501.405
SMILES:
COc1cc(Nc2c(cnc3cc(OCC4CCN(C)CC4)c(OC)cc23)C#N)c(Cl)cc1Cl
: