Target
Glycogen synthase kinase-3 beta
Ligand
BDBM50475001
Substrate
Meas. Tech.
ChEMBL_312789 (CHEMBL833438)
IC50
5.0±n/a nM
Citation
 Engler, TAMalhotra, SBurkholder, TPHenry, JRMendel, DPorter, WJFurness, KDiefenbacher, CMarquart, AReel, JKLi, YClayton, JCunningham, BMcLean, JO'toole, JCBrozinick, JHawkins, EMisener, EBriere, DBrier, RAWagner, JRCampbell, RMAnderson, BDVaughn, RBennett, DBMeier, TICook, JA The development of potent and selective bisarylmaleimide GSK3 inhibitors. Bioorg Med Chem Lett 15:899-903 (2005)  
Target
Name:
Glycogen synthase kinase-3 beta
Synonyms:
GSK-3 beta GSK3B Glycogen synthase kinase 3 beta (GSK3B) Glycogen synthase kinase-3 beta (GSK-3B) Glycogen synthase kinase-3 beta (GSK3B) Glycogen synthase kinase-3beta (GSK3B) | Serine/threonine-protein kinase GSK3B
Type:
Enzyme
Mol. Mass.:
46756.38
Organism:
Homo sapiens (Human)
Description:
P49841
Residue:
420
  
Inhibitor
Name:
BDBM50475001
Synonyms:
CHEMBL368246
Type:
Small organic molecule
Emp. Form.:
C26H23N5O3
Mol. Mass.:
453.4925
SMILES:
CC(C)C(=O)N1CCn2cc(C3=C(C(=O)NC3=O)c3cnc4ccccn34)c3cccc(C1)c23
: