Target
Glycogen synthase kinase-3
Ligand
BDBM50475025
Substrate
Meas. Tech.
ChEMBL_305938 (CHEMBL833485)
IC50
0.800000±n/a nM
Citation
 Engler, TAMalhotra, SBurkholder, TPHenry, JRMendel, DPorter, WJFurness, KDiefenbacher, CMarquart, AReel, JKLi, YClayton, JCunningham, BMcLean, JO'toole, JCBrozinick, JHawkins, EMisener, EBriere, DBrier, RAWagner, JRCampbell, RMAnderson, BDVaughn, RBennett, DBMeier, TICook, JA The development of potent and selective bisarylmaleimide GSK3 inhibitors. Bioorg Med Chem Lett 15:899-903 (2005)  
Target
Name:
Glycogen synthase kinase-3
Synonyms:
Glycogen synthase kinase-3 alpha/beta
Type:
Mol. Mass.:
Description:
ASSAY_ID of ChEMBL is 2193535
Components:
This complex has 2 components.
Component 1
Name:
Glycogen synthase kinase-3 alpha
Synonyms:
GSK-3 alpha GSK3A_HUMAN Glycogen synthase kinase-3 Glycogen synthase kinase-3 alpha (GSK3 Alpha) Glycogen synthase kinase-3 alpha (GSK3alpha)
Type:
Enzyme
Mol. Mass.:
50991.79
Organism:
Homo sapiens (Human)
Description:
P49840
Residue:
483
  
Component 2
Name:
Glycogen synthase kinase-3 beta
Synonyms:
GSK-3 beta GSK3B Glycogen synthase kinase 3 beta (GSK3B) Glycogen synthase kinase-3 beta (GSK-3B) Glycogen synthase kinase-3 beta (GSK3B) Glycogen synthase kinase-3beta (GSK3B) | Serine/threonine-protein kinase GSK3B
Type:
Enzyme
Mol. Mass.:
46756.38
Organism:
Homo sapiens (Human)
Description:
P49841
Residue:
420
  
Inhibitor
Name:
BDBM50475025
Synonyms:
CHEMBL181339
Type:
Small organic molecule
Emp. Form.:
C28H25N5O4
Mol. Mass.:
495.5292
SMILES:
O=C(C1CCOCC1)N1CCn2cc(C3=C(C(=O)NC3=O)c3cnc4ccccn34)c3cccc(C1)c23
: