Target
UDP-galactopyranose mutase
Ligand
BDBM53451
Substrate
Meas. Tech.
ChEMBL_312805 (CHEMBL837765)
IC50
168000±n/a nM
Citation
 Tangallapally, RPYendapally, RLee, REHevener, KJones, VCLenaerts, AJMcNeil, MRWang, YFranzblau, SLee, RE Synthesis and evaluation of nitrofuranylamides as novel antituberculosis agents. J Med Chem 47:5276-83 (2004)  
Target
Name:
UDP-galactopyranose mutase
Synonyms:
GLF_MYCTU Uridine 5'-diphosphate-galactopyranose mutase (UGM) | glf
Type:
Protein
Mol. Mass.:
45807.82
Organism:
Mycobacterium tuberculosis H37Rv
Description:
P9WIQ1
Residue:
399
  
Inhibitor
Name:
BDBM53451
Synonyms:
MLS001163735 N-(1-adamantyl)-5-nitro-2-furancarboxamide N-(1-adamantyl)-5-nitrofuran-2-carboxamide O-acyl oxime isatin derivative, 37 cid_2994355
Type:
Small organic molecule
Emp. Form.:
C15H18N2O4
Mol. Mass.:
290.3144
SMILES:
[H]C12CC3([H])CC([H])(C1)CC(C2)(C3)NC(=O)c1ccc(o1)[N+]([O-])=O
: