Target
UDP-galactopyranose mutase
Ligand
BDBM96269
Substrate
Meas. Tech.
ChEMBL_312805 (CHEMBL837765)
IC50
205000±n/a nM
Citation
 Tangallapally, RPYendapally, RLee, REHevener, KJones, VCLenaerts, AJMcNeil, MRWang, YFranzblau, SLee, RE Synthesis and evaluation of nitrofuranylamides as novel antituberculosis agents. J Med Chem 47:5276-83 (2004)  
Target
Name:
UDP-galactopyranose mutase
Synonyms:
GLF_MYCTU Uridine 5'-diphosphate-galactopyranose mutase (UGM) | glf
Type:
Protein
Mol. Mass.:
45807.82
Organism:
Mycobacterium tuberculosis H37Rv
Description:
P9WIQ1
Residue:
399
  
Inhibitor
Name:
BDBM96269
Synonyms:
5-Nitro-furan-2-carboxylic acid pyridin-3-ylamide 5-nitro-N-(3-pyridyl)-2-furamide 5-nitro-N-pyridin-3-ylfuran-2-carboxamide SMR000515217 | cid_148471
Type:
Small organic molecule
Emp. Form.:
C10H7N3O4
Mol. Mass.:
233.1803
SMILES:
[O-][N+](=O)c1ccc(o1)C(=O)Nc1cccnc1
: