Target
UDP-galactopyranose mutase
Ligand
BDBM65582
Substrate
Meas. Tech.
ChEMBL_312805 (CHEMBL837765)
IC50
160000±n/a nM
Citation
 Tangallapally, RPYendapally, RLee, REHevener, KJones, VCLenaerts, AJMcNeil, MRWang, YFranzblau, SLee, RE Synthesis and evaluation of nitrofuranylamides as novel antituberculosis agents. J Med Chem 47:5276-83 (2004)  
Target
Name:
UDP-galactopyranose mutase
Synonyms:
GLF_MYCTU Uridine 5'-diphosphate-galactopyranose mutase (UGM) | glf
Type:
Protein
Mol. Mass.:
45807.82
Organism:
Mycobacterium tuberculosis H37Rv
Description:
P9WIQ1
Residue:
399
  
Inhibitor
Name:
BDBM65582
Synonyms:
5-Nitro-furan-2-carboxylic acid (4-methoxy-phenyl)-amide N-(4-methoxyphenyl)-5-nitro-2-furamide N-(4-methoxyphenyl)-5-nitro-furan-2-carboxamide SMR000513391 | cid_774010
Type:
Small organic molecule
Emp. Form.:
C12H10N2O5
Mol. Mass.:
262.2182
SMILES:
COc1ccc(NC(=O)c2ccc(o2)[N+]([O-])=O)cc1
: