Target
UDP-galactopyranose mutase
Ligand
BDBM50475085
Substrate
Meas. Tech.
ChEMBL_312805 (CHEMBL837765)
IC50
64300±n/a nM
Citation
 Tangallapally, RPYendapally, RLee, REHevener, KJones, VCLenaerts, AJMcNeil, MRWang, YFranzblau, SLee, RE Synthesis and evaluation of nitrofuranylamides as novel antituberculosis agents. J Med Chem 47:5276-83 (2004)  
Target
Name:
UDP-galactopyranose mutase
Synonyms:
GLF_MYCTU Uridine 5'-diphosphate-galactopyranose mutase (UGM) | glf
Type:
Protein
Mol. Mass.:
45807.82
Organism:
Mycobacterium tuberculosis H37Rv
Description:
P9WIQ1
Residue:
399
  
Inhibitor
Name:
BDBM50475085
Synonyms:
CHEMBL188537
Type:
Small organic molecule
Emp. Form.:
C18H15NO5S
Mol. Mass.:
357.38
SMILES:
COc1cccc(NC(=O)c2ccc(o2)S(=O)(=O)c2ccccc2)c1
: