Target
UDP-galactopyranose mutase
Ligand
BDBM49921
Substrate
Meas. Tech.
ChEMBL_312805 (CHEMBL837765)
IC50
245000±n/a nM
Citation
 Tangallapally, RPYendapally, RLee, REHevener, KJones, VCLenaerts, AJMcNeil, MRWang, YFranzblau, SLee, RE Synthesis and evaluation of nitrofuranylamides as novel antituberculosis agents. J Med Chem 47:5276-83 (2004)  
Target
Name:
UDP-galactopyranose mutase
Synonyms:
GLF_MYCTU Uridine 5'-diphosphate-galactopyranose mutase (UGM) | glf
Type:
Protein
Mol. Mass.:
45807.82
Organism:
Mycobacterium tuberculosis H37Rv
Description:
P9WIQ1
Residue:
399
  
Inhibitor
Name:
BDBM49921
Synonyms:
MLS000708257 N-(2-furfuryl)-5-nitro-2-furamide N-(furan-2-ylmethyl)-5-nitrofuran-2-carboxamide cid_694001
Type:
Small organic molecule
Emp. Form.:
C10H8N2O5
Mol. Mass.:
236.1809
SMILES:
[O-][N+](=O)c1ccc(o1)C(=O)NCc1ccco1
: