Target
UDP-galactopyranose mutase
Ligand
BDBM50475092
Substrate
Meas. Tech.
ChEMBL_312805 (CHEMBL837765)
IC50
259000±n/a nM
Citation
 Tangallapally, RPYendapally, RLee, REHevener, KJones, VCLenaerts, AJMcNeil, MRWang, YFranzblau, SLee, RE Synthesis and evaluation of nitrofuranylamides as novel antituberculosis agents. J Med Chem 47:5276-83 (2004)  
Target
Name:
UDP-galactopyranose mutase
Synonyms:
GLF_MYCTU Uridine 5'-diphosphate-galactopyranose mutase (UGM) | glf
Type:
Protein
Mol. Mass.:
45807.82
Organism:
Mycobacterium tuberculosis H37Rv
Description:
P9WIQ1
Residue:
399
  
Inhibitor
Name:
BDBM50475092
Synonyms:
CHEMBL184206
Type:
Small organic molecule
Emp. Form.:
C12H10N2O4
Mol. Mass.:
246.2188
SMILES:
CN(C(=O)c1ccc(o1)[N+]([O-])=O)c1ccccc1
: