Target
UDP-galactopyranose mutase
Ligand
BDBM50475093
Substrate
Meas. Tech.
ChEMBL_312805 (CHEMBL837765)
IC50
209000±n/a nM
Citation
 Tangallapally, RPYendapally, RLee, REHevener, KJones, VCLenaerts, AJMcNeil, MRWang, YFranzblau, SLee, RE Synthesis and evaluation of nitrofuranylamides as novel antituberculosis agents. J Med Chem 47:5276-83 (2004)  
Target
Name:
UDP-galactopyranose mutase
Synonyms:
GLF_MYCTU Uridine 5'-diphosphate-galactopyranose mutase (UGM) | glf
Type:
Protein
Mol. Mass.:
45807.82
Organism:
Mycobacterium tuberculosis H37Rv
Description:
P9WIQ1
Residue:
399
  
Inhibitor
Name:
BDBM50475093
Synonyms:
CHEMBL188467
Type:
Small organic molecule
Emp. Form.:
C13H9N3O5S
Mol. Mass.:
319.293
SMILES:
COc1cccc2sc(NC(=O)c3ccc(o3)[N+]([O-])=O)nc12
: