Target
UDP-galactopyranose mutase
Ligand
BDBM50475097
Substrate
Meas. Tech.
ChEMBL_312805 (CHEMBL837765)
IC50
82700±n/a nM
Citation
 Tangallapally, RPYendapally, RLee, REHevener, KJones, VCLenaerts, AJMcNeil, MRWang, YFranzblau, SLee, RE Synthesis and evaluation of nitrofuranylamides as novel antituberculosis agents. J Med Chem 47:5276-83 (2004)  
Target
Name:
UDP-galactopyranose mutase
Synonyms:
GLF_MYCTU Uridine 5'-diphosphate-galactopyranose mutase (UGM) | glf
Type:
Protein
Mol. Mass.:
45807.82
Organism:
Mycobacterium tuberculosis H37Rv
Description:
P9WIQ1
Residue:
399
  
Inhibitor
Name:
BDBM50475097
Synonyms:
CHEMBL188250
Type:
Small organic molecule
Emp. Form.:
C18H14N2O5
Mol. Mass.:
338.3142
SMILES:
[O-][N+](=O)c1ccc(o1)C(=O)Nc1cccc(OCc2ccccc2)c1
: