Target
Androgen receptor
Ligand
BDBM18684
Substrate
Meas. Tech.
ChEMBL_304043 (CHEMBL877110)
Ki
141±n/a nM
Citation
 Söderholm, AALehtovuori, PTNyrönen, TH Three-dimensional structure-activity relationships of nonsteroidal ligands in complex with androgen receptor ligand-binding domain. J Med Chem 48:917-25 (2005)  
Target
Name:
Androgen receptor
Synonyms:
ANDR_RAT Ar Nr3c4 | androgen
Type:
Enzyme
Mol. Mass.:
98219.08
Organism:
Rattus norvegicus (Rat)
Description:
P15207
Residue:
902
  
Inhibitor
Name:
BDBM18684
Synonyms:
(2R)-N-[4-cyano-3-(trifluoromethyl)phenyl]-2-hydroxy-3-[(3-isothiocyanatobenzene)sulfonyl]-2-methylpropanamide | Bicalutamide Analogue, (R)-10
Type:
Small organic molecule
Emp. Form.:
C19H14F3N3O4S2
Mol. Mass.:
469.457
SMILES:
C[C@](O)(CS(=O)(=O)c1cccc(c1)N=C=S)C(=O)Nc1ccc(C#N)c(c1)C(F)(F)F
: