Target
Voltage-dependent L-type calcium channel subunit alpha-1S
Ligand
BDBM50475650
Substrate
Meas. Tech.
ChEMBL_333794 (CHEMBL864734)
IC50
6.8±n/a nM
Citation
 Yamamoto, TNiwa, SOhno, SOnishi, TMatsueda, HKoganei, HUneyama, HFujita, STakeda, TKito, MOno, YSaitou, YTakahara, AIwata, SShoji, M Structure-activity relationship study of 1,4-dihydropyridine derivatives blocking N-type calcium channels. Bioorg Med Chem Lett 16:798-802 (2006)  
Target
Name:
Voltage-dependent L-type calcium channel subunit alpha-1S
Synonyms:
CAC1S_RAT Cacn1 Cacnl1a3 Cchl1a3 Voltage-gated L-type calcium channel Voltage-gated calcium channel subunit alpha Cav1.1
Type:
PROTEIN
Mol. Mass.:
210392.58
Organism:
Rattus norvegicus
Description:
ChEMBL_92777
Residue:
1850
  
Inhibitor
Name:
BDBM50475650
Synonyms:
CHEMBL203041
Type:
Small organic molecule
Emp. Form.:
C25H24ClNO4
Mol. Mass.:
437.915
SMILES:
CC1=NC(C)=C(C(\C1=C(/O)OC\C=C\c1ccc(C)cc1)c1cccc(Cl)c1)C(O)=O
: