Target
Neuronal acetylcholine receptor subunit alpha-4/beta-2
Ligand
BDBM50187455
Substrate
Meas. Tech.
ChEMBL_358724 (CHEMBL870196)
IC50
0.640000±n/a nM
Citation
 Audouze, KNielsen, EØOlsen, GMAhring, PJørgensen, TDPeters, DLiljefors, TBalle, T New ligands with affinity for the alpha4beta2 subtype of nicotinic acetylcholine receptors. Synthesis, receptor binding, and 3D-QSAR modeling. J Med Chem 49:3159-71 (2006)  
Target
Name:
Neuronal acetylcholine receptor subunit alpha-4/beta-2
Synonyms:
Neuronal acetylcholine receptor alpha4/beta2 Neuronal acetylcholine receptor; alpha4/beta2
Type:
Mol. Mass.:
Description:
Components:
This complex has 0 components.
Component 1
Name:
Neuronal acetylcholine receptor subunit alpha-4
Synonyms:
ACHA4_RAT Cholinergic, Nicotinic Alpha4Beta2 Chrna4 Neuronal acetylcholine receptor (alpha4beta2 nAChR) Neuronal acetylcholine receptor subunit alpha 4 beta 2 | Neuronal acetylcholine receptor subunit alpha-4
Type:
Enzyme
Mol. Mass.:
70196.44
Organism:
Rattus norvegicus (Rat)
Description:
P09483
Residue:
630
  
Component 2
Name:
Neuronal acetylcholine receptor subunit beta-2
Synonyms:
ACHB2_RAT Chrnb2 Neuronal acetylcholine receptor non-alpha-1 chain
Type:
Enzyme
Mol. Mass.:
56910.32
Organism:
Rattus norvegicus (Rat)
Description:
P12390
Residue:
500
  
Inhibitor
Name:
BDBM50187455
Synonyms:
1-(6-Bromo-5-vinylpyridin-3-yl)-[1,4]diazepane CHEMBL379501
Type:
Small organic molecule
Emp. Form.:
C12H16BrN3O
Mol. Mass.:
298.179
SMILES:
Brc1ncc(cc1OC=C)N1CCCNCC1
: