Target
Ornithine decarboxylase
Ligand
BDBM50476064
Substrate
Meas. Tech.
ChEMBL_423435 (CHEMBL909394)
IC50
18900±n/a nM
Citation
 Williams, PGAsolkar, RNKondratyuk, TPezzuto, JMJensen, PRFenical, W Saliniketals A and B, bicyclic polyketides from the marine actinomycete Salinispora arenicola. J Nat Prod 70:83-8 (2007)  
Target
Name:
Ornithine decarboxylase
Synonyms:
DCOR_HUMAN ODC1
Type:
PROTEIN
Mol. Mass.:
51136.54
Organism:
Homo sapiens (Human)
Description:
ChEMBL_423773
Residue:
461
  
Inhibitor
Name:
BDBM50476064
Synonyms:
SALINIKETAL B
Type:
Small organic molecule
Emp. Form.:
C22H37NO6
Mol. Mass.:
411.5323
SMILES:
[H][C@]12CC[C@@](C)(O1)O[C@@]([H])([C@H](C)[C@H](O)[C@H](C)[C@@H](O)[C@@H](C)\C=C\C=C(\CO)C(N)=O)[C@@H]2C
: