Target
D(2) dopamine receptor
Ligand
BDBM50241119
Substrate
Meas. Tech.
ChEMBL_426001 (CHEMBL907460)
Ki
1.5±n/a nM
Citation
 Cuisiat, SBourdiol, NLacharme, VNewman-Tancredi, AColpaert, FVacher, B Towards a new generation of potential antipsychotic agents combining D2 and 5-HT1A receptor activities. J Med Chem 50:865-76 (2007)  
Target
Name:
D(2) dopamine receptor
Synonyms:
DOPAMINE D2 DOPAMINE D2 Short Dopamine D2 receptor Drd2
Type:
G Protein-Coupled Receptor (GPCR)
Mol. Mass.:
50931.60
Organism:
Rattus norvegicus (rat)
Description:
P61169
Residue:
444
  
Inhibitor
Name:
BDBM50241119
Synonyms:
7-(4-Biphenyl-3-ylmethyl-piperazin-1-yl)-3H-benzooxazol-2-one CHEMBL218166
Type:
Small organic molecule
Emp. Form.:
C24H23N3O2
Mol. Mass.:
385.4583
SMILES:
O=c1[nH]c2cccc(N3CCN(Cc4cccc(c4)-c4ccccc4)CC3)c2o1
: