Target
Alpha-2A adrenergic receptor
Ligand
BDBM50417350
Substrate
Meas. Tech.
ChEMBL_429548 (CHEMBL918089)
Ki
28±n/a nM
Citation
 Gentili, FGhelfi, FGiannella, MPiergentili, APigini, MQuaglia, WVesprini, CCrassous, PAParis, HCarrieri, A alpha 2-adrenoreceptors profile modulation. 2. Biphenyline analogues as tools for selective activation of the alpha 2C-subtype. J Med Chem 47:6160-73 (2004)  
Target
Name:
Alpha-2A adrenergic receptor
Synonyms:
ADA2A_HUMAN ADRA2R Adrenergic alpha2A Alpha-2 adrenergic receptor subtype C10 Alpha-2A adrenoreceptor alpha-2A adrenergic receptor [Homo sapiens]
Type:
Enzyme
Mol. Mass.:
48979.91
Organism:
Homo sapiens (Human)
Description:
P08913
Residue:
465
  
Inhibitor
Name:
BDBM50417350
Synonyms:
CHEMBL374584
Type:
Small organic molecule
Emp. Form.:
C17H18N2O2
Mol. Mass.:
282.337
SMILES:
CC(Oc1ccccc1-c1cccc(O)c1)C1=NCCN1
: