Target
Alpha-2B adrenergic receptor
Ligand
BDBM50417350
Substrate
Meas. Tech.
ChEMBL_429545 (CHEMBL918086)
Ki
355±n/a nM
Citation
 Gentili, FGhelfi, FGiannella, MPiergentili, APigini, MQuaglia, WVesprini, CCrassous, PAParis, HCarrieri, A alpha 2-adrenoreceptors profile modulation. 2. Biphenyline analogues as tools for selective activation of the alpha 2C-subtype. J Med Chem 47:6160-73 (2004)  
Target
Name:
Alpha-2B adrenergic receptor
Synonyms:
ADA2B_HUMAN ADRA2L1 Adrenergic alpha2B Adrenergic receptor alpha Alpha-2 adrenergic receptor subtype C2 Alpha-2B adrenoreceptor | Alpha-2BAR
Type:
Enzyme
Mol. Mass.:
49964.20
Organism:
Homo sapiens (Human)
Description:
P18089
Residue:
450
  
Inhibitor
Name:
BDBM50417350
Synonyms:
CHEMBL374584
Type:
Small organic molecule
Emp. Form.:
C17H18N2O2
Mol. Mass.:
282.337
SMILES:
CC(Oc1ccccc1-c1cccc(O)c1)C1=NCCN1
: