Target
Alpha-2C adrenergic receptor
Ligand
BDBM50417350
Substrate
Meas. Tech.
ChEMBL_429543 (CHEMBL918084)
EC50
47±n/a nM
Citation
 Gentili, FGhelfi, FGiannella, MPiergentili, APigini, MQuaglia, WVesprini, CCrassous, PAParis, HCarrieri, A alpha 2-adrenoreceptors profile modulation. 2. Biphenyline analogues as tools for selective activation of the alpha 2C-subtype. J Med Chem 47:6160-73 (2004)  
Target
Name:
Alpha-2C adrenergic receptor
Synonyms:
ADA2C_HUMAN ADRA2L2 Adrenergic alpha2C Adrenergic receptor alpha Alpha-2 adrenergic receptor subtype C4 Alpha-2C adrenoreceptor | adrenergic, alpha-2C-, receptor [Homo sapiens]
Type:
Enzyme
Mol. Mass.:
49552.32
Organism:
Homo sapiens (Human)
Description:
P18825
Residue:
462
  
Inhibitor
Name:
BDBM50417350
Synonyms:
CHEMBL374584
Type:
Small organic molecule
Emp. Form.:
C17H18N2O2
Mol. Mass.:
282.337
SMILES:
CC(Oc1ccccc1-c1cccc(O)c1)C1=NCCN1
: