Target
Pepsin A
Ligand
BDBM50027906
Substrate
Meas. Tech.
ChEMBL_154017 (CHEMBL759138)
Ki
10±n/a nM
Citation
 Rich, DHSalituro, FG Synthesis of analogues of pepstatin. Effect of structure in subsites P1', P2', and P2 on inhibition of porcine pepsin. J Med Chem 26:904-10 (1983)  
Target
Name:
Pepsin A
Synonyms:
PEPA_PIG Pepsin | Pepsin A precursor
Type:
Enzyme
Mol. Mass.:
41232.87
Organism:
Porcine
Description:
Residue:
385
  
Inhibitor
Name:
BDBM50027906
Synonyms:
3-Hydroxy-6-methyl-4-[4-methyl-2-(3-methyl-butyrylamino)-pentanoylamino]-heptanoic acid [1-(3-methyl-butylcarbamoyl)-ethyl]-amide | CHEMBL352409
Type:
Small organic molecule
Emp. Form.:
C23H44N4O5
Mol. Mass.:
456.6193
SMILES:
CC(C)CCNC(=O)C(C)NC(=O)CC(O)C(CC(C)C)NC(=O)CNC(=O)CC(C)C
: