Target
Pepsin A
Ligand
BDBM50027909
Substrate
Meas. Tech.
ChEBML_154017
Ki
1.5±n/a nM
Citation
 Rich, DHSalituro, FG Synthesis of analogues of pepstatin. Effect of structure in subsites P1', P2', and P2 on inhibition of porcine pepsin. J Med Chem 26:904-10 (1983)  
Target
Name:
Pepsin A
Synonyms:
PEPA_PIG Pepsin | Pepsin A precursor
Type:
Enzyme
Mol. Mass.:
41232.87
Organism:
Porcine
Description:
Residue:
385
  
Inhibitor
Name:
BDBM50027909
Synonyms:
2-(2-{3-Hydroxy-6-methyl-4-[3-methyl-2-(3-methyl-butyrylamino)-butyrylamino]-heptanoylamino}-propionylamino)-3-phenyl-propionic acid methyl ester | CHEMBL352982
Type:
Small organic molecule
Emp. Form.:
C31H50N4O7
Mol. Mass.:
590.7513
SMILES:
COC(=O)C(Cc1ccccc1)NC(=O)C(C)NC(=O)CC(O)C(CC(C)C)NC(=O)C(NC(=O)CC(C)C)C(C)C
: