Target
Pepsin A
Ligand
BDBM50027915
Substrate
Meas. Tech.
ChEBML_154017
Ki
4.6±n/a nM
Citation
 Rich, DHSalituro, FG Synthesis of analogues of pepstatin. Effect of structure in subsites P1', P2', and P2 on inhibition of porcine pepsin. J Med Chem 26:904-10 (1983)  
Target
Name:
Pepsin A
Synonyms:
PEPA_PIG Pepsin | Pepsin A precursor
Type:
Enzyme
Mol. Mass.:
41232.87
Organism:
Porcine
Description:
Residue:
385
  
Inhibitor
Name:
BDBM50027915
Synonyms:
3-Hydroxy-6-methyl-4-[3-methyl-2-(3-methyl-butyrylamino)-butyrylamino]-heptanoic acid [3-methyl-1-(3-methyl-butylcarbamoyl)-butyl]-amide | CHEMBL173430
Type:
Small organic molecule
Emp. Form.:
C29H56N4O5
Mol. Mass.:
540.7787
SMILES:
CC(C)CCNC(=O)C(CC(C)C)NC(=O)CC(O)C(CC(C)C)NC(=O)C(NC(=O)CC(C)C)C(C)C
: