Target
Sodium-dependent serotonin transporter
Ligand
BDBM50020707
Substrate
Meas. Tech.
ChEBML_129898
IC50
100.0±n/a nM
Citation
 Högberg, TUlff, BRenyi, ALRoss, SB Synthesis of pyridylallylamines related to zimelidine and their inhibition of neuronal monoamine uptake. J Med Chem 24:1499-507 (1982)  
Target
Name:
Sodium-dependent serotonin transporter
Synonyms:
5-HT Transporter 5HT transporter Anandamid membrane transporter, AMT Monoamine transporters; Norepinephrine & serotonin Slc6a4 Sodium-dependent serotonin transporter (SERT) | imipramine receptor
Type:
Multi-pass membrane protein
Mol. Mass.:
70168.43
Organism:
Rattus norvegicus (rat)
Description:
P31652
Residue:
630
  
Inhibitor
Name:
BDBM50020707
Synonyms:
CHEMBL287064 Norzimelidine cis -[3-(4-Bromo-phenyl)-3-pyridin-3-yl-allyl]-methyl-amine ;C2H4O4 | trans-[3-(4-Bromo-phenyl)-3-pyridin-3-yl-allyl]-methyl-amine;C2H4O4
Type:
Small organic molecule
Emp. Form.:
C15H15BrN2
Mol. Mass.:
303.197
SMILES:
CNC\C=C(\c1ccc(Br)cc1)c1cccnc1
: