Target
5-hydroxytryptamine receptor 1A
Ligand
BDBM50187377
Substrate
Meas. Tech.
ChEMBL_446119 (CHEMBL895214)
EC50
93±n/a nM
Citation
 Maurel, JLAutin, JMFunes, PNewman-Tancredi, AColpaert, FVacher, B High-efficacy 5-HT1A agonists for antidepressant treatment: a renewed opportunity. J Med Chem 50:5024-33 (2007)  
Target
Name:
5-hydroxytryptamine receptor 1A
Synonyms:
5-HT-1A 5-hydroxytryptamine receptor 1A (5-HT-1A) ADRB2RL1 Dopamine D2 receptor and serotonin 1a receptor HTR1A | Serotonin receptor 1A
Type:
Mol. Mass.:
46122.49
Organism:
Homo sapiens (Human)
Description:
Residue:
422
  
Inhibitor
Name:
BDBM50187377
Synonyms:
CHEMBL209821 N-{3-[4-(4-cyclohexylmethanesulfonylamino-butyl)-piperazin-1-yl]-phenyl}-acetamide
Type:
Small organic molecule
Emp. Form.:
C23H38N4O3S
Mol. Mass.:
450.638
SMILES:
CC(=O)Nc1cccc(c1)N1CCN(CCCCNS(=O)(=O)CC2CCCCC2)CC1
: