Target
Cholecystokinin receptor type A
Ligand
BDBM50477904
Substrate
Meas. Tech.
ChEMBL_461021 (CHEMBL944977)
Ki
63±n/a nM
Citation
 Low, CMVinter, JG Rationalizing the activities of diverse cholecystokinin 2 receptor antagonists using molecular field points. J Med Chem 51:565-73 (2008)  
Target
Name:
Cholecystokinin receptor type A
Synonyms:
CCK-A receptor CCK1-R CCKAR_CAVPO Cholecystokinin receptor type A | Cholecystokinin-1 receptor
Type:
Mol. Mass.:
48229.77
Organism:
Cavia porcellus
Description:
Residue:
430
  
Inhibitor
Name:
BDBM50477904
Synonyms:
CHEMBL401098
Type:
Small organic molecule
Emp. Form.:
C42H47N5O8
Mol. Mass.:
749.8513
SMILES:
COc1ccc(CCNC(=O)[C@H](CC(O)=O)NC(=O)[C@H](Cc2ccc3ccccc3c2)NC(=O)[C@H](Cc2c[nH]c3ccccc23)NC(=O)OC(C)(C)C)cc1
: