Target
Cholecystokinin receptor type A
Ligand
BDBM50056102
Substrate
Meas. Tech.
ChEMBL_461021 (CHEMBL944977)
Ki
398±n/a nM
Citation
 Low, CMVinter, JG Rationalizing the activities of diverse cholecystokinin 2 receptor antagonists using molecular field points. J Med Chem 51:565-73 (2008)  
Target
Name:
Cholecystokinin receptor type A
Synonyms:
CCK-A receptor CCK1-R CCKAR_CAVPO Cholecystokinin receptor type A | Cholecystokinin-1 receptor
Type:
Mol. Mass.:
48229.77
Organism:
Cavia porcellus
Description:
Residue:
430
  
Inhibitor
Name:
BDBM50056102
Synonyms:
(R)-1-(1-(3,3-dimethyl-2-oxobutyl)-2-oxo-5-(pyridin-2-yl)-2,3-dihydro-1H-benzo[e][1,4]diazepin-3-yl)-3-(3-(methylamino)phenyl)urea CHEMBL324547 | YF-476
Type:
Small organic molecule
Emp. Form.:
C28H30N6O3
Mol. Mass.:
498.5762
SMILES:
CNc1cccc(NC(=O)N[C@@H]2N=C(c3ccccn3)c3ccccc3N(CC(=O)C(C)(C)C)C2=O)c1
: