Target
Cholecystokinin receptor type A
Ligand
BDBM50477908
Substrate
Meas. Tech.
ChEMBL_461021 (CHEMBL944977)
Ki
316±n/a nM
Citation
 Low, CMVinter, JG Rationalizing the activities of diverse cholecystokinin 2 receptor antagonists using molecular field points. J Med Chem 51:565-73 (2008)  
Target
Name:
Cholecystokinin receptor type A
Synonyms:
CCK-A receptor CCK1-R CCKAR_CAVPO Cholecystokinin receptor type A | Cholecystokinin-1 receptor
Type:
Mol. Mass.:
48229.77
Organism:
Cavia porcellus
Description:
Residue:
430
  
Inhibitor
Name:
BDBM50477908
Synonyms:
CHEMBL398312
Type:
Small organic molecule
Emp. Form.:
C24H20N8O2
Mol. Mass.:
452.468
SMILES:
CN1c2ccccc2C(=N[C@@H](NC(=O)Nc2cccc(c2)-c2nnn[nH]2)C1=O)c1ccccc1
: