Target
Integrase
Ligand
BDBM50478002
Substrate
Meas. Tech.
ChEMBL_463501 (CHEMBL932796)
IC50
7.2±n/a nM
Citation
 Dayam, RAl-Mawsawi, LQZawahir, ZWitvrouw, MDebyser, ZNeamati, N Quinolone 3-carboxylic acid pharmacophore: design of second generation HIV-1 integrase inhibitors. J Med Chem 51:1136-44 (2008)  
Target
Name:
Integrase
Synonyms:
pol
Type:
PROTEIN
Mol. Mass.:
32203.43
Organism:
Human immunodeficiency virus 1
Description:
ChEMBL_106649
Residue:
288
  
Inhibitor
Name:
BDBM50478002
Synonyms:
CHEMBL408699
Type:
Small organic molecule
Emp. Form.:
C23H23ClFNO5
Mol. Mass.:
447.884
SMILES:
COc1cc2n(cc(C(O)=O)c(=O)c2cc1Cc1cccc(Cl)c1F)[C@@H](CO)C(C)C
: