Target
Ornithine decarboxylase
Ligand
BDBM50028195
Substrate
Meas. Tech.
ChEBML_148131
Ki
56000±n/a nM
Citation
 Bey, PGerhart, FVan Dorsselaer, VDanzin, C alpha-(Fluoromethyl)dehydroornithine and alpha-(fluoromethyl)dehydroputrescine analogues as irreversible inhibitors of ornithine decarboxylase. J Med Chem 26:1551-6 (1983)  
Target
Name:
Ornithine decarboxylase
Synonyms:
DCOR_RAT Odc1
Type:
PROTEIN
Mol. Mass.:
51037.04
Organism:
Rattus norvegicus
Description:
ChEMBL_1344641
Residue:
461
  
Inhibitor
Name:
BDBM50028195
Synonyms:
5-Fluoro-pentane-1,4-diamine | CHEMBL290500
Type:
Small organic molecule
Emp. Form.:
C5H13FN2
Mol. Mass.:
120.1685
SMILES:
NCCCC(N)CF
: