Target
Integrase
Ligand
BDBM50021581
Substrate
Meas. Tech.
ChEMBL_475584 (CHEMBL926888)
IC50
0.500000±n/a nM
Citation
 Dubois, MBailly, FMbemba, GMouscadet, JFDebyser, ZWitvrouw, MCotelle, P Reaction of rosmarinic acid with nitrite ions in acidic conditions: discovery of nitro- and dinitrorosmarinic acids as new anti-HIV-1 agents. J Med Chem 51:2575-9 (2008)  
Target
Name:
Integrase
Synonyms:
pol
Type:
PROTEIN
Mol. Mass.:
32203.43
Organism:
Human immunodeficiency virus 1
Description:
ChEMBL_106649
Residue:
288
  
Inhibitor
Name:
BDBM50021581
Synonyms:
CHEMBL414850 | L-870810
Type:
Small organic molecule
Emp. Form.:
C20H19FN4O4S
Mol. Mass.:
430.453
SMILES:
O\C(=N/Cc1ccc(F)cc1)c1nc(N2CCCCS2(=O)=O)c2cccnc2c1O
: