Target
Muscarinic acetylcholine receptor M5
Ligand
BDBM50028298
Substrate
Meas. Tech.
ChEBML_139742
IC50
>100000±n/a nM
Citation
 Griffith, RCGentile, RJRobichaud, RCFrankenheim, J cis-1,3,4,6,7,11b-Hexahydro-2-methyl-7-phenyl-2H-pyrazino[2,1-a] isoquinoline: a new atypical antidepressant. J Med Chem 27:995-1003 (1984)  
Target
Name:
Muscarinic acetylcholine receptor M5
Synonyms:
ACM5_RAT Chrm-5 Muscarinic acetylcholine receptor | Muscarinic acetylcholine receptor M5
Type:
Enzyme Catalytic Domain
Mol. Mass.:
60161.80
Organism:
RAT
Description:
Cholinergic, muscarinic M5 CHRM5 RAT::P08911
Residue:
531
  
Inhibitor
Name:
BDBM50028298
Synonyms:
CHEMBL6574 | cis-2-Benzyl-7-phenyl-1,3,4,6,7,11b-hexahydro-2H-pyrazino[2,1-a]isoquinoline
Type:
Small organic molecule
Emp. Form.:
C25H26N2
Mol. Mass.:
354.4873
SMILES:
C(N1CCN2CC(c3ccccc3)c3ccccc3C2C1)c1ccccc1
: