Target
Muscarinic acetylcholine receptor M5
Ligand
BDBM50028306
Substrate
Meas. Tech.
ChEBML_139742
IC50
4000±n/a nM
Citation
 Griffith, RCGentile, RJRobichaud, RCFrankenheim, J cis-1,3,4,6,7,11b-Hexahydro-2-methyl-7-phenyl-2H-pyrazino[2,1-a] isoquinoline: a new atypical antidepressant. J Med Chem 27:995-1003 (1984)  
Target
Name:
Muscarinic acetylcholine receptor M5
Synonyms:
ACM5_RAT Chrm-5 Muscarinic acetylcholine receptor | Muscarinic acetylcholine receptor M5
Type:
Enzyme Catalytic Domain
Mol. Mass.:
60161.80
Organism:
RAT
Description:
Cholinergic, muscarinic M5 CHRM5 RAT::P08911
Residue:
531
  
Inhibitor
Name:
BDBM50028306
Synonyms:
CHEMBL414182 | cis-Dimethyl-(4-phenyl-1,2,3,4-tetrahydro-isoquinolin-1-ylmethyl)-amine
Type:
Small organic molecule
Emp. Form.:
C18H22N2
Mol. Mass.:
266.3807
SMILES:
CN(C)CC1NCC(c2ccccc2)c2ccccc12
: